BDBM399630 US10323036, Compound I-74::US10793574, Compound I-74::US11220508, Compound I-74
SMILES COc1c(F)cccc1Nc1cc(Nc2cc(C)nc(C)n2)nc2[nH]n(C)c(=O)c12
InChI Key InChIKey=RVOIYPIZIHAYQX-UHFFFAOYSA-N
Data  3 Kd
  Tab Delimited (TSV)   2D SDfile   Computed 3D by Vconf -m prep SDfile
Find this compound or compounds like it in BindingDB:
Activity Spreadsheet -- Enzyme Inhibition Constant Data from BindingDB
Found 3 hits for monomerid = 399630
TargetNon-receptor tyrosine-protein kinase TYK2 [V731I](Homo sapiens (Human))
Nimbus Lakshmi
US Patent
LigandPNGBDBM399630(US10323036, Compound I-74 | US10793574, Compound I...)
Affinity DataKd:  0.300nM. Assay description: Binding constants for compounds of the present invention against the JH2 domain were determined by the following protocol for a KINOMEscan® assay (Di...
Ligand InfoPC cidPC sid
In DepthDetails US Patent
TargetNon-receptor tyrosine-protein kinase TYK2 [556-888](Homo sapiens (Human))
Nimbus Lakshmi
US Patent
LigandPNGBDBM399630(US10323036, Compound I-74 | US10793574, Compound I...)
Affinity DataKd:  0.300nM. Assay description: The binding reaction was assembled by combining 16 μl of DNA-tagged kinase extract, 3.8 μl liganded affinity beads, and 0.18 μl test c...
Ligand InfoPC cidPC sid
In DepthDetails US Patent
TargetNon-receptor tyrosine-protein kinase TYK2 [556-888](Homo sapiens (Human))
Nimbus Lakshmi
US Patent
LigandPNGBDBM399630(US10323036, Compound I-74 | US10793574, Compound I...)
Affinity DataKd:  0.300nM. Assay description: Binding constants for compounds of the present invention against the JH2 domain were determined by the following protocol for a KINOMEscan® assay (Di...
Ligand InfoPC cidPC sid
In DepthDetails US Patent