BDBM400129 7-(2-((1-(1H-1,2,3-triazol-4-yl)cyclopropyl)amino)-2-oxoacetyl)-6-methyl-N-(2,3,4-trifluorophenyl)-2,3-dihydro-1H-pyrrolizine-5-carboxamide ::US10328053, Compound 111::US10874640, Compound 111::US20230270719, Compound 111
SMILES Cc1c(C(=O)C(=O)NC2(CC2)c2c[nH]nn2)c2CCCn2c1C(=O)Nc1ccc(F)c(F)c1F
InChI Key InChIKey=QMHZTQOYPKXGJC-UHFFFAOYSA-N
Data  3 EC50
  Tab Delimited (TSV)   2D SDfile   Computed 3D by Vconf -m prep SDfile
Find this compound or compounds like it in BindingDB:
Activity Spreadsheet -- Enzyme Inhibition Constant Data from BindingDB
Found 3 hits for monomerid = 400129
TargetSodium/bile acid cotransporter(Homo sapiens (Human))
Gilead Sciences
US Patent
LigandPNGBDBM400129(7-(2-((1-(1H-1,2,3-triazol-4-yl)cyclopropyl)amino)...)
Affinity DataEC50:  154nM. Assay description: A HepG2 cell line overexpressing the HBV virus attachment receptor sodium-taurocholate cotransporting polypeptide (NTCP) was grown to confluency in D...
Ligand InfoPC cidPC sid
In DepthDetails US Patent
TargetSodium/bile acid cotransporter(Homo sapiens (Human))
Gilead Sciences
US Patent
LigandPNGBDBM400129(7-(2-((1-(1H-1,2,3-triazol-4-yl)cyclopropyl)amino)...)
Affinity DataEC50:  154nM. Assay description: A HepG2 cell line overexpressing the HBV virus attachment receptor sodium-taurocholate cotransporting polypeptide (NTCP) was grown to confluency in D...
Ligand InfoPC cidPC sid
In DepthDetails US Patent
TargetCapsid protein(Hepatitis B virus genotype C subtype ayr (isolate ...)
Gilead Sciences
US Patent
LigandPNGBDBM400129(7-(2-((1-(1H-1,2,3-triazol-4-yl)cyclopropyl)amino)...)
Affinity DataEC50:  154nM. Assay description: A HepG2 cell line overexpressing the HBV virus attachment receptor sodium-taurocholate cotransporting polypeptide (NTCP) was grown to confluency in D...
Ligand InfoPC cidPC sid
In DepthDetails US Patent