BDBM401031 US10005735, Compound 29
SMILES Cc1nc(CCNC(=O)c2cnc3c(S)cccc3c2)sc1C(O)=O
InChI Key InChIKey=GVLFCNDYWJLMKQ-UHFFFAOYSA-N
Data  3 IC50
  Tab Delimited (TSV)   2D SDfile   Computed 3D by Vconf -m prep SDfile
Find this compound or compounds like it in BindingDB:
Activity Spreadsheet -- Enzyme Inhibition Constant Data from BindingDB
Found 3 hits for monomerid = 401031
Target26S proteasome non-ATPase regulatory subunit 14(Homo sapiens (Human))
California Institute Of Technology
US Patent
LigandPNGBDBM401031(US10005735, Compound 29)
Affinity DataIC50:  1.10E+3nM. Assay description: In brief, this Rpn11 bioassay employs a fluorescent polarization readout based on the ability of the 26S proteasome to cleave the protein substrate i...
Ligand InfoPC cidPC sid
In DepthDetails US Patent
TargetAMSH-like protease(Homo sapiens (Human))
California Institute Of Technology
US Patent
LigandPNGBDBM401031(US10005735, Compound 29)
Affinity DataIC50:  800nM. Assay description: In brief, this Rpn11 bioassay employs a fluorescent polarization readout based on the ability of the 26S proteasome to cleave the protein substrate i...
Ligand InfoPC cidPC sid
In DepthDetails US Patent
TargetCOP9 signalosome complex subunit 5(Homo sapiens (Human))
California Institute Of Technology
US Patent
LigandPNGBDBM401031(US10005735, Compound 29)
Affinity DataIC50: >2.00E+4nM. Assay description: In brief, this Rpn11 bioassay employs a fluorescent polarization readout based on the ability of the 26S proteasome to cleave the protein substrate i...
Ligand InfoPC cidPC sid
In DepthDetails US Patent