BDBM404171 (2S,5R)-5-(2-bromophenyl)-1-(2'-methoxy-[1,1'-biphenyl]-4-carbonyl)pyrrolidine-2-carboxylic acid::US10017468, Compound 338::US10781171, Compound 338::US11072582, Compound 338
SMILES COc1ccccc1-c1ccc(cc1)C(=O)N1[C@@H](CC[C@@H]1c1ccccc1Br)C(O)=O
InChI Key InChIKey=GXWKJWPONBGMIS-YADHBBJMSA-N
Data  4 EC50
  Tab Delimited (TSV)   2D SDfile   Computed 3D by Vconf -m prep SDfile
Find this compound or compounds like it in BindingDB:
Activity Spreadsheet -- Enzyme Inhibition Constant Data from BindingDB
Found 4 hits for monomerid = 404171
TargetFree fatty acid receptor 2(Homo sapiens (Human))
Epics Therapeutics
US Patent
LigandPNGBDBM404171((2S,5R)-5-(2-bromophenyl)-1-(2'-methoxy-[1,1'-biph...)
Affinity DataEC50: <200nM. Assay description: The [35S]GTPγS assay was incubated in 20 mM HEPES pH7.4, 100 mM NaCl, 10 μg/ml saponin, 30 mM of MgCl2, 10 μM of GDP, 5 μg membra...
Ligand InfoPC cidPC sid
In DepthDetails US Patent
TargetFree fatty acid receptor 2(Homo sapiens (Human))
Epics Therapeutics
US Patent
LigandPNGBDBM404171((2S,5R)-5-(2-bromophenyl)-1-(2'-methoxy-[1,1'-biph...)
Affinity DataEC50: <200nM. Assay description: The assay was used to determine the activity of the compounds of the invention. The [35S]GTPγS assay was incubated in 20 mM HEPES pH7.4, 100 mM ...
Ligand InfoPC cidPC sid
In DepthDetails US Patent
TargetFree fatty acid receptor 2(Homo sapiens (Human))
Epics Therapeutics
US Patent
LigandPNGBDBM404171((2S,5R)-5-(2-bromophenyl)-1-(2'-methoxy-[1,1'-biph...)
Affinity DataEC50: <200nM. Assay description: The assay was used to determine the activity of the compounds of the invention.The [35S]GTPγS assay was incubated in 20 mM HEPES pH7.4, 100 mM N...
Ligand InfoPC cidPC sid
In DepthDetails US Patent
TargetFree fatty acid receptor 2(Homo sapiens (Human))
Epics Therapeutics
US Patent
LigandPNGBDBM404171((2S,5R)-5-(2-bromophenyl)-1-(2'-methoxy-[1,1'-biph...)
Affinity DataEC50: <200nM. Assay description: The following assay can be used for determination of GPR43 activation. When a GPCR is in its active state, either as a result of ligand binding or co...
Ligand InfoPC cidPC sid
In DepthDetails US Patent