BDBM40423 (4E)-4-[(4-methylphenyl)-oxidanyl-methylidene]-1-(5-methyl-1,3,4-thiadiazol-2-yl)-5-(4-propan-2-ylphenyl)pyrrolidine-2,3-dione::(4E)-4-[hydroxy(p-tolyl)methylene]-1-(5-methyl-1,3,4-thiadiazol-2-yl)-5-p-cumenyl-pyrrolidine-2,3-quinone::(4E)-4-[hydroxy-(4-methylphenyl)methylidene]-1-(5-methyl-1,3,4-thiadiazol-2-yl)-5-(4-propan-2-ylphenyl)pyrrolidine-2,3-dione::UNM000003560901::cid_5937360
SMILES CC(C)c1ccc(cc1)C1C(C(=O)c2ccc(C)cc2)C(=O)C(=O)N1c1nnc(C)s1
InChI Key InChIKey=QAADJGLUEXTTND-UHFFFAOYSA-N
Data  2 KI  1 IC50
  Tab Delimited (TSV)   2D SDfile   Computed 3D by Vconf -m prep SDfile
Find this compound or compounds like it in BindingDB:
Activity Spreadsheet -- Enzyme Inhibition Constant Data from BindingDB
Found 3 hits for monomerid = 40423
TargetN-formyl peptide receptor 2(Homo sapiens (Human))
Nmmlsc
Curated by PubChem BioAssay
LigandPNGBDBM40423((4E)-4-[(4-methylphenyl)-oxidanyl-methylidene]-1-(...)
Affinity DataKi: >4.03E+4nM. Assay description: University of New Mexico Assay Overview: Assay Support: NIH 1R03MH076381-01 Assay for Formylpeptide Receptor Family Ligands PI: Bruce S. Edwards, Ph...
In DepthDetails PCBioAssay
TargetfMet-Leu-Phe receptor(Homo sapiens (Human))
Nmmlsc
Curated by PubChem BioAssay
LigandPNGBDBM40423((4E)-4-[(4-methylphenyl)-oxidanyl-methylidene]-1-(...)
Affinity DataKi: >4.43E+4nM. Assay description: University of New Mexico Assay Overview: Assay Support: NIH 1R03MH076381-01 Assay for Formylpeptide Receptor Family Ligands PI: Bruce S. Edwards, Ph...
In DepthDetails PCBioAssay
TargetN-formyl peptide receptor 2(Homo sapiens (Human))
Nmmlsc
Curated by PubChem BioAssay
LigandPNGBDBM40423((4E)-4-[(4-methylphenyl)-oxidanyl-methylidene]-1-(...)
Affinity DataIC50: >6.67E+4nM. Assay description: University of New Mexico Assay Overview: Assay Support: NIH 1R03MH076381-01 Assay for Formylpeptide Receptor Family Ligands PI: Bruce S. Edwards, Ph...
In DepthDetails PCBioAssay