BDBM40438 1-(4-bromophenyl)-3-ethanoyl-2-(3-methoxy-4-oxidanyl-phenyl)-4-oxidanyl-2H-pyrrol-5-one::3-acetyl-1-(4-bromophenyl)-4-hydroxy-2-(4-hydroxy-3-methoxyphenyl)-2H-pyrrol-5-one::4-acetyl-1-(4-bromophenyl)-3-hydroxy-5-(4-hydroxy-3-methoxy-phenyl)-3-pyrrolin-2-one::UNM000003599001::cid_2868794
SMILES COc1cc(ccc1O)C1C(C(C)=O)C(=O)C(=O)N1c1ccc(Br)cc1
InChI Key InChIKey=YNBXACXDRXNNOR-UHFFFAOYSA-N
Data  2 KI  1 IC50
  Tab Delimited (TSV)   2D SDfile   Computed 3D by Vconf -m prep SDfile
Find this compound or compounds like it in BindingDB:
Activity Spreadsheet -- Enzyme Inhibition Constant Data from BindingDB
Found 3 hits for monomerid = 40438
TargetN-formyl peptide receptor 2(Homo sapiens (Human))
Nmmlsc
Curated by PubChem BioAssay
LigandPNGBDBM40438(1-(4-bromophenyl)-3-ethanoyl-2-(3-methoxy-4-oxidan...)
Affinity DataKi: >4.03E+4nM. Assay description: University of New Mexico Assay Overview: Assay Support: NIH 1R03MH076381-01 Assay for Formylpeptide Receptor Family Ligands PI: Bruce S. Edwards, Ph...
In DepthDetails PCBioAssay
TargetfMet-Leu-Phe receptor(Homo sapiens (Human))
Nmmlsc
Curated by PubChem BioAssay
LigandPNGBDBM40438(1-(4-bromophenyl)-3-ethanoyl-2-(3-methoxy-4-oxidan...)
Affinity DataKi: >4.43E+4nM. Assay description: University of New Mexico Assay Overview: Assay Support: NIH 1R03MH076381-01 Assay for Formylpeptide Receptor Family Ligands PI: Bruce S. Edwards, Ph...
In DepthDetails PCBioAssay
TargetN-formyl peptide receptor 2(Homo sapiens (Human))
Nmmlsc
Curated by PubChem BioAssay
LigandPNGBDBM40438(1-(4-bromophenyl)-3-ethanoyl-2-(3-methoxy-4-oxidan...)
Affinity DataIC50: >6.67E+4nM. Assay description: University of New Mexico Assay Overview: Assay Support: NIH 1R03MH076381-01 Assay for Formylpeptide Receptor Family Ligands PI: Bruce S. Edwards, Ph...
In DepthDetails PCBioAssay