BDBM40442 (4Z)-1-(3-bromanyl-4-methyl-phenyl)-5-(3-fluorophenyl)-4-[oxidanyl(phenyl)methylidene]pyrrolidine-2,3-dione::(4Z)-1-(3-bromo-4-methyl-phenyl)-5-(3-fluorophenyl)-4-[hydroxy(phenyl)methylene]pyrrolidine-2,3-quinone::(4Z)-1-(3-bromo-4-methylphenyl)-5-(3-fluorophenyl)-4-[hydroxy(phenyl)methylidene]pyrrolidine-2,3-dione::UNM000003603001::cid_5292787
SMILES Cc1ccc(cc1Br)N1C(C(C(=O)c2ccccc2)C(=O)C1=O)c1cccc(F)c1
InChI Key InChIKey=DDCGPLGLJJMLQF-UHFFFAOYSA-N
Data  2 KI  1 IC50
  Tab Delimited (TSV)   2D SDfile   Computed 3D by Vconf -m prep SDfile
Find this compound or compounds like it in BindingDB:
Activity Spreadsheet -- Enzyme Inhibition Constant Data from BindingDB
Found 3 hits for monomerid = 40442
TargetN-formyl peptide receptor 2(Homo sapiens (Human))
Nmmlsc
Curated by PubChem BioAssay
LigandPNGBDBM40442((4Z)-1-(3-bromanyl-4-methyl-phenyl)-5-(3-fluorophe...)
Affinity DataKi: >4.03E+4nM. Assay description: University of New Mexico Assay Overview: Assay Support: NIH 1R03MH076381-01 Assay for Formylpeptide Receptor Family Ligands PI: Bruce S. Edwards, Ph...
In DepthDetails PCBioAssay
TargetfMet-Leu-Phe receptor(Homo sapiens (Human))
Nmmlsc
Curated by PubChem BioAssay
LigandPNGBDBM40442((4Z)-1-(3-bromanyl-4-methyl-phenyl)-5-(3-fluorophe...)
Affinity DataKi: >4.43E+4nM. Assay description: University of New Mexico Assay Overview: Assay Support: NIH 1R03MH076381-01 Assay for Formylpeptide Receptor Family Ligands PI: Bruce S. Edwards, Ph...
In DepthDetails PCBioAssay
TargetN-formyl peptide receptor 2(Homo sapiens (Human))
Nmmlsc
Curated by PubChem BioAssay
LigandPNGBDBM40442((4Z)-1-(3-bromanyl-4-methyl-phenyl)-5-(3-fluorophe...)
Affinity DataIC50: >6.67E+4nM. Assay description: University of New Mexico Assay Overview: Assay Support: NIH 1R03MH076381-01 Assay for Formylpeptide Receptor Family Ligands PI: Bruce S. Edwards, Ph...
In DepthDetails PCBioAssay