BDBM40509 MLS000045019::N-(1,3-benzothiazol-2-yl)-2-(4-ketochromeno[4,3-c]pyrazol-1-yl)acetamide::N-(1,3-benzothiazol-2-yl)-2-(4-oxidanylidenechromeno[4,3-c]pyrazol-1-yl)ethanamide::N-(1,3-benzothiazol-2-yl)-2-(4-oxo-1-[1]benzopyrano[4,3-c]pyrazolyl)acetamide::N-(1,3-benzothiazol-2-yl)-2-(4-oxochromeno[4,3-c]pyrazol-1-yl)acetamide::N-1,3-benzothiazol-2-yl-2-(4-oxochromeno[4,3-c]pyrazol-1(4H)-yl)acetamide::SMR000026623::cid_3240598
SMILES O=C(Cn1ncc2c1c1ccccc1oc2=O)Nc1nc2ccccc2s1
InChI Key InChIKey=YTJAVXWZTLORKR-UHFFFAOYSA-N
Data  1 EC50
  Tab Delimited (TSV)   2D SDfile   Computed 3D by Vconf -m prep SDfile
Find this compound or compounds like it in BindingDB:
Activity Spreadsheet -- Enzyme Inhibition Constant Data from BindingDB
Found 1 hit for monomerid = 40509
TargetEstrogen receptor(Homo sapiens (Human))
Emory University
Curated by PubChem BioAssay
LigandPNGBDBM40509(MLS000045019 | N-(1,3-benzothiazol-2-yl)-2-(4-keto...)
Affinity DataEC50:  6.23E+3nM. Assay description: NIH Molecular Libraries Screening Centers Network [MLSCN] Emory Chemical Biology Discovery Center in MLSCN Assay provider: John A. Katzenellenbogen, ...
Ligand InfoPC cidPC sid
In DepthDetails PCBioAssay