BDBM40541 2-[2-[4-[(2-fluorobenzoyl)amino]furazan-3-yl]benzimidazol-1-yl]acetic acid ethyl ester::2-[2-[4-[[(2-fluorophenyl)-oxomethyl]amino]-1,2,5-oxadiazol-3-yl]-1-benzimidazolyl]acetic acid ethyl ester::MLS000110698::SMR000106627::cid_1043575::ethyl 2-[2-[4-[(2-fluorobenzoyl)amino]-1,2,5-oxadiazol-3-yl]benzimidazol-1-yl]acetate::ethyl 2-[2-[4-[(2-fluorophenyl)carbonylamino]-1,2,5-oxadiazol-3-yl]benzimidazol-1-yl]ethanoate
SMILES CCOC(=O)Cn1c(nc2ccccc12)-c1nonc1NC(=O)c1ccccc1F
InChI Key InChIKey=IEPWZZCIRVBASB-UHFFFAOYSA-N
Data  1 EC50
  Tab Delimited (TSV)   2D SDfile   Computed 3D by Vconf -m prep SDfile
Find this compound or compounds like it in BindingDB:
Activity Spreadsheet -- Enzyme Inhibition Constant Data from BindingDB
Found 1 hit for monomerid = 40541
TargetEstrogen receptor(Homo sapiens (Human))
Emory University
Curated by PubChem BioAssay
LigandPNGBDBM40541(2-[2-[4-[(2-fluorobenzoyl)amino]furazan-3-yl]benzi...)
Affinity DataEC50:  1.00E+7nM. Assay description: NIH Molecular Libraries Screening Centers Network [MLSCN] Emory Chemical Biology Discovery Center in MLSCN Assay provider: John A. Katzenellenbogen, ...
In DepthDetails PCBioAssay