BDBM40834 3-(1-azepanylsulfonyl)-N-[5-methyl-2-(2-pyridinyl)-3-pyrazolyl]benzamide::3-(azepan-1-ylsulfonyl)-N-(5-methyl-2-pyridin-2-yl-pyrazol-3-yl)benzamide::3-(azepan-1-ylsulfonyl)-N-(5-methyl-2-pyridin-2-ylpyrazol-3-yl)benzamide::3-(azepan-1-ylsulfonyl)-N-[5-methyl-2-(2-pyridyl)pyrazol-3-yl]benzamide::MLS000096524::SMR000062230::cid_2999383
SMILES Cc1cc(NC(=O)c2cccc(c2)S(=O)(=O)N2CCCCCC2)n(n1)-c1ccccn1
InChI Key InChIKey=CLTIJOXTKDYRSE-UHFFFAOYSA-N
Data  1 IC50
  Tab Delimited (TSV)   2D SDfile   Computed 3D by Vconf -m prep SDfile
Find this compound or compounds like it in BindingDB:
Activity Spreadsheet -- Enzyme Inhibition Constant Data from BindingDB
Found 1 hit for monomerid = 40834
TargetComplement C1s subcomponent(Homo sapiens (Human))
Pcmd
Curated by PubChem BioAssay
LigandPNGBDBM40834(3-(1-azepanylsulfonyl)-N-[5-methyl-2-(2-pyridinyl)...)
Affinity DataIC50: >5.00E+4nM. Assay description: Molecular Library Screening Center Network (MLSCN) Penn Center for Molecular Discovery (PCMD) Assay Provider: Dr. Scott L. Diamond, University of Pen...
In DepthDetails PCBioAssay