BDBM40930 2-methyl-5-(2-thienyl)thieno[2,3-d][1,3]oxazin-4-one::2-methyl-5-thiophen-2-yl-4-thieno[2,3-d][1,3]oxazinone::2-methyl-5-thiophen-2-yl-thieno[2,3-d][1,3]oxazin-4-one::2-methyl-5-thiophen-2-ylthieno[2,3-d][1,3]oxazin-4-one::MLS000113430::SMR000109329::cid_804822
SMILES Cc1nc2scc(-c3cccs3)c2c(=O)o1
InChI Key InChIKey=DGPHFMOEGCZWOK-UHFFFAOYSA-N
Data  3 IC50
  Tab Delimited (TSV)   2D SDfile   Computed 3D by Vconf -m prep SDfile
Find this compound or compounds like it in BindingDB:
Activity Spreadsheet -- Enzyme Inhibition Constant Data from BindingDB
Found 3 hits for monomerid = 40930
TargetComplement C1s subcomponent(Homo sapiens (Human))
Pcmd
Curated by PubChem BioAssay
LigandPNGBDBM40930(2-methyl-5-(2-thienyl)thieno[2,3-d][1,3]oxazin-4-o...)
Affinity DataIC50: >5.00E+4nM. Assay description: Molecular Library Screening Center Network (MLSCN) Penn Center for Molecular Discovery (PCMD) Assay Provider: Dr. Scott L. Diamond, University of Pen...
In DepthDetails PCBioAssay
TargetCoagulation factor XII(Homo sapiens (Human))
Pcmd
Curated by PubChem BioAssay
LigandPNGBDBM40930(2-methyl-5-(2-thienyl)thieno[2,3-d][1,3]oxazin-4-o...)
Affinity DataIC50:  2.93E+4nM. Assay description: Molecular Library Screening Center Network (MLSCN) Penn Center for Molecular Discovery (PCMD) Assay Provider: Scott L. Diamond, University of Pennsy...
In DepthDetails PCBioAssay
TargetCathepsin G(Homo sapiens (Human))
Pcmd
Curated by PubChem BioAssay
LigandPNGBDBM40930(2-methyl-5-(2-thienyl)thieno[2,3-d][1,3]oxazin-4-o...)
Affinity DataIC50: >5.00E+4nM. Assay description: Screening Center: Penn Center for Molecular Discovery Center Affiliation: University of Pennsylvania Network: Molecular Library Screening Center Netw...
In DepthDetails PCBioAssay