BDBM40962 3-(trifluoromethyl)-5H-pyrido[2,3-b][1,4]benzothiazine::MLS000054601::SMR000061365::cid_2997875
SMILES FC(F)(F)c1cnc2Sc3ccccc3Nc2c1
InChI Key InChIKey=JDKUGFSKOBHFMC-UHFFFAOYSA-N
Data  2 IC50
  Tab Delimited (TSV)   2D SDfile   Computed 3D by Vconf -m prep SDfile
Find this compound or compounds like it in BindingDB:
Activity Spreadsheet -- Enzyme Inhibition Constant Data from BindingDB
Found 2 hits for monomerid = 40962
TargetProtein-tyrosine kinase 2-beta(Homo sapiens (Human))
The Scripps Research Institute Molecular Screening Center
Curated by PubChem BioAssay
LigandPNGBDBM40962(3-(trifluoromethyl)-5H-pyrido[2,3-b][1,4]benzothia...)
Affinity DataIC50: >6.95E+4nM. Assay description: Source (MLPCN Center Name): The Scripps Research Institute Molecular Screening Center (SRIMSC) Affiliation: The Scripps Research Institute, TSRI Assa...
Ligand InfoPC cidPC sid
In DepthDetails PCBioAssay
TargetFocal adhesion kinase 1(Homo sapiens (Human))
The Scripps Research Institute Molecular Screening Center
Curated by PubChem BioAssay
LigandPNGBDBM40962(3-(trifluoromethyl)-5H-pyrido[2,3-b][1,4]benzothia...)
Affinity DataIC50:  3.87E+3nM. Assay description: Source (MLSCN Center Name): The Scripps Research Institute Molecular Screening Center Center Affiliation: The Scripps Research Institute, TSRI Assa...
Ligand InfoPC cidPC sid
In DepthDetails PCBioAssay