BDBM41097 2-[(2-Benzotriazol-1-yl-acetyl)-pyridin-3-yl-amino]-N-(2-methoxy-ethyl)-2-(3-methoxy-phenyl)-acetamide::2-[2-(benzotriazol-1-yl)ethanoyl-pyridin-3-yl-amino]-N-(2-methoxyethyl)-2-(3-methoxyphenyl)ethanamide::2-[[2-(1-benzotriazolyl)-1-oxoethyl]-(3-pyridinyl)amino]-N-(2-methoxyethyl)-2-(3-methoxyphenyl)acetamide::2-[[2-(benzotriazol-1-yl)acetyl]-(3-pyridyl)amino]-N-(2-methoxyethyl)-2-(3-methoxyphenyl)acetamide::2-[[2-(benzotriazol-1-yl)acetyl]-pyridin-3-ylamino]-N-(2-methoxyethyl)-2-(3-methoxyphenyl)acetamide::MLS000032366::SMR000005231::cid_655872
SMILES COCCNC(=O)C(N(C(=O)Cn1nnc2ccccc12)c1cccnc1)c1cccc(OC)c1
InChI Key InChIKey=WJDHEANDPICURG-UHFFFAOYSA-N
Data  2 IC50
  Tab Delimited (TSV)   2D SDfile   Computed 3D by Vconf -m prep SDfile
Find this compound or compounds like it in BindingDB:
Activity Spreadsheet -- Enzyme Inhibition Constant Data from BindingDB
Found 2 hits for monomerid = 41097
TargetProcathepsin L(Homo sapiens (Human))
Pcmd
Curated by PubChem BioAssay
LigandPNGBDBM41097(2-[(2-Benzotriazol-1-yl-acetyl)-pyridin-3-yl-amino...)
Affinity DataIC50: >5.00E+4nM. Assay description: Screening Center: Penn Center for Molecular Discovery Center Affiliation: University of Pennsylvania Network: Molecular Library Screening Center Netw...
In DepthDetails PCBioAssay
TargetCathepsin B(Homo sapiens (Human))
Pcmd
Curated by PubChem BioAssay
LigandPNGBDBM41097(2-[(2-Benzotriazol-1-yl-acetyl)-pyridin-3-yl-amino...)
Affinity DataIC50: >5.00E+4nM. Assay description: Screening Center: Penn Center for Molecular Discovery Center Affiliation: University of Pennsylvania Network: Molecular Library Screening Center Netw...
In DepthDetails PCBioAssay