BDBM41186 2,3-dihydro-1,4-benzodioxin-3-ylmethyl(7H-purin-6-yl)amine::MLS000101258::N-(2,3-dihydro-1,4-benzodioxin-3-ylmethyl)-7H-purin-6-amine::SMR000017656::cid_4391746
SMILES C(Nc1ncnc2nc[nH]c12)C1COc2ccccc2O1
InChI Key InChIKey=KEQSBMDPEZPFFR-UHFFFAOYSA-N
Data  2 IC50
  Tab Delimited (TSV)   2D SDfile   Computed 3D by Vconf -m prep SDfile
Find this compound or compounds like it in BindingDB:
Activity Spreadsheet -- Enzyme Inhibition Constant Data from BindingDB
Found 2 hits for monomerid = 41186
TargetProcathepsin L(Homo sapiens (Human))
Pcmd
Curated by PubChem BioAssay
LigandPNGBDBM41186(2,3-dihydro-1,4-benzodioxin-3-ylmethyl(7H-purin-6-...)
Affinity DataIC50: >5.00E+4nM. Assay description: Screening Center: Penn Center for Molecular Discovery Center Affiliation: University of Pennsylvania Network: Molecular Library Screening Center Netw...
In DepthDetails PCBioAssay
TargetProcathepsin L(Homo sapiens (Human))
Pcmd
Curated by PubChem BioAssay
LigandPNGBDBM41186(2,3-dihydro-1,4-benzodioxin-3-ylmethyl(7H-purin-6-...)
Affinity DataIC50: >5.00E+4nM. Assay description: Screening Center: Penn Center for Molecular Discovery Center Affiliation: University of Pennsylvania Network: Molecular Library Screening Center Netw...
In DepthDetails PCBioAssay