BDBM41204 2-(7-Butyl-1,3-dimethyl-2,6-dioxo-2,3,6,7-tetrahydro-1H-purin-8-ylsulfanyl)-N-(5-methyl-[1,3,4]thiadiazol-2-yl)-acetamide::2-(7-butyl-1,3-dimethyl-2,6-dioxopurin-8-yl)sulfanyl-N-(5-methyl-1,3,4-thiadiazol-2-yl)acetamide::2-[(7-butyl-1,3-dimethyl-2,6-dioxo-8-purinyl)thio]-N-(5-methyl-1,3,4-thiadiazol-2-yl)acetamide::2-[(7-butyl-2,6-diketo-1,3-dimethyl-purin-8-yl)thio]-N-(5-methyl-1,3,4-thiadiazol-2-yl)acetamide::2-[7-butyl-1,3-dimethyl-2,6-bis(oxidanylidene)purin-8-yl]sulfanyl-N-(5-methyl-1,3,4-thiadiazol-2-yl)ethanamide::MLS000030598::SMR000002656::cid_653722
SMILES CCCCn1c(SCC(=O)Nc2nnc(C)s2)nc2n(C)c(=O)n(C)c(=O)c12
InChI Key InChIKey=CBBUWAUCLQEIKW-UHFFFAOYSA-N
Data  1 IC50
  Tab Delimited (TSV)   2D SDfile   Computed 3D by Vconf -m prep SDfile
Find this compound or compounds like it in BindingDB:
Activity Spreadsheet -- Enzyme Inhibition Constant Data from BindingDB
Found 1 hit for monomerid = 41204
TargetDNA-directed RNA polymerase subunit beta(Escherichia coli)
Pcmd
Curated by PubChem BioAssay
LigandPNGBDBM41204(2-(7-Butyl-1,3-dimethyl-2,6-dioxo-2,3,6,7-tetrahyd...)
Affinity DataIC50: >5.00E+4nM. Assay description: Screening Center: Penn Center for Molecular Discovery Center Affiliation: University of Pennsylvania Network: Molecular Library Screening Center Netw...
In DepthDetails PCBioAssay