BDBM412304 US10399945, Example 39::US10669239, Compound 39::US10927079, Compound 39
SMILES Cc1ccc(NC(=O)N[C@H]2[C@H](O)CC(C)(C)c3cc(F)c(F)cc23)c(n1)-c1ccccc1
InChI Key InChIKey=CJWGVNJNEHGPBU-FYYLOGMGSA-N
Data  3 IC50
  Tab Delimited (TSV)   2D SDfile   Computed 3D by Vconf -m prep SDfile
Find this compound or compounds like it in BindingDB:
Activity Spreadsheet -- Enzyme Inhibition Constant Data from BindingDB
Found 3 hits for monomerid = 412304
TargetHigh affinity nerve growth factor receptor(Homo sapiens (Human))
Mochida Pharmaceutical
US Patent
LigandPNGBDBM412304(US10399945, Example 39 | US10669239, Compound 39 |...)
Affinity DataIC50: <50nM. Assay description: Measurement was carried out using TrkA LanthaScreen (registered trademark) Eu Kinase Binding Assay (ThermoFisher SCIENTIFIC). To a 384 well plate (Co...
Ligand Info
In DepthDetails US Patent
TargetHigh affinity nerve growth factor receptor(Homo sapiens (Human))
Mochida Pharmaceutical
US Patent
LigandPNGBDBM412304(US10399945, Example 39 | US10669239, Compound 39 |...)
Affinity DataIC50: <0.100nM. Assay description: Measurement was carried out using TrkA LanthaScreen (registered trademark) Eu Kinase Binding Assay (ThermoFisher SCIENTIFIC). To a 384 well plate (Co...
Ligand Info
In DepthDetails US Patent
TargetHigh affinity nerve growth factor receptor(Homo sapiens (Human))
Mochida Pharmaceutical
US Patent
LigandPNGBDBM412304(US10399945, Example 39 | US10669239, Compound 39 |...)
Affinity DataIC50: <50nM. Assay description: Measurement was carried out using TrkA LanthaScreen (registered trademark) Eu Kinase Binding Assay (ThermoFisher SCIENTIFIC). To a 384 well plate (Co...
Ligand Info
In DepthDetails US Patent