BDBM41234 3-methyl-N-(1,2-oxazol-3-yl)-5-oxidanylidene-[1,3]thiazolo[3,2-a]pyrimidine-6-carboxamide::3-methyl-N-(1,2-oxazol-3-yl)-5-oxo-[1,3]thiazolo[3,2-a]pyrimidine-6-carboxamide::MLS000092098::N-(3-isoxazolyl)-3-methyl-5-oxo-6-thiazolo[3,2-a]pyrimidinecarboxamide::N-isoxazol-3-yl-5-keto-3-methyl-thiazolo[3,2-a]pyrimidine-6-carboxamide::SMR000016416::cid_3237796
SMILES Cc1csc2ncc(C(=O)Nc3ccon3)c(=O)n12
InChI Key InChIKey=DMNHQCHUXCUWEW-UHFFFAOYSA-N
Data  1 IC50
  Tab Delimited (TSV)   2D SDfile   Computed 3D by Vconf -m prep SDfile
Find this compound or compounds like it in BindingDB:
Activity Spreadsheet -- Enzyme Inhibition Constant Data from BindingDB
Found 1 hit for monomerid = 41234
TargetDNA-directed RNA polymerase subunit beta(Escherichia coli)
Pcmd
Curated by PubChem BioAssay
LigandPNGBDBM41234(3-methyl-N-(1,2-oxazol-3-yl)-5-oxidanylidene-[1,3]...)
Affinity DataIC50: >5.00E+4nM. Assay description: Screening Center: Penn Center for Molecular Discovery Center Affiliation: University of Pennsylvania Network: Molecular Library Screening Center Netw...
In DepthDetails PCBioAssay