BDBM41241 2-furancarboxylic acid 4-[[5-(4-bromophenyl)-1,3,4-oxadiazol-2-yl]thio]but-2-ynyl ester::4-[[5-(4-bromophenyl)-1,3,4-oxadiazol-2-yl]sulfanyl]but-2-ynyl furan-2-carboxylate::4-{[5-(4-bromophenyl)-1,3,4-oxadiazol-2-yl]thio}but-2-ynyl 2-furoate::MLS000043084::SMR000019511::cid_3241175::furan-2-carboxylic acid 4-[[5-(4-bromophenyl)-1,3,4-oxadiazol-2-yl]thio]but-2-ynyl ester
SMILES Brc1ccc(cc1)-c1nnc(SCC#CCOC(=O)c2ccco2)o1
InChI Key InChIKey=AEHRWLMVAGTIDL-UHFFFAOYSA-N
Data  1 IC50
  Tab Delimited (TSV)   2D SDfile   Computed 3D by Vconf -m prep SDfile
Find this compound or compounds like it in BindingDB:
Activity Spreadsheet -- Enzyme Inhibition Constant Data from BindingDB
Found 1 hit for monomerid = 41241
TargetDNA-directed RNA polymerase subunit beta(Escherichia coli)
Pcmd
Curated by PubChem BioAssay
LigandPNGBDBM41241(2-furancarboxylic acid 4-[[5-(4-bromophenyl)-1,3,4...)
Affinity DataIC50: >5.00E+4nM. Assay description: Screening Center: Penn Center for Molecular Discovery Center Affiliation: University of Pennsylvania Network: Molecular Library Screening Center Netw...
In DepthDetails PCBioAssay