BDBM41243 4-amino-3-(2,5-dimethylphenyl)-2-sulfanylidene-1,3-thiazole-5-carboxamide::4-amino-3-(2,5-dimethylphenyl)-2-sulfanylidene-5-thiazolecarboxamide::4-amino-3-(2,5-dimethylphenyl)-2-thioxo-2,3-dihydro-1,3-thiazole-5-carboxamide::4-amino-3-(2,5-dimethylphenyl)-2-thioxo-4-thiazoline-5-carboxamide::4-azanyl-3-(2,5-dimethylphenyl)-2-sulfanylidene-1,3-thiazole-5-carboxamide::MLS000043081::SMR000019508::cid_3241917
SMILES Cc1ccc(C)c(c1)-n1c(N)c(sc1=S)C(N)=O
InChI Key InChIKey=LEQPHBJJCYEWRY-UHFFFAOYSA-N
Data  1 IC50
  Tab Delimited (TSV)   2D SDfile   Computed 3D by Vconf -m prep SDfile
Find this compound or compounds like it in BindingDB:
Activity Spreadsheet -- Enzyme Inhibition Constant Data from BindingDB
Found 1 hit for monomerid = 41243
TargetDNA-directed RNA polymerase subunit beta(Escherichia coli)
Pcmd
Curated by PubChem BioAssay
LigandPNGBDBM41243(4-amino-3-(2,5-dimethylphenyl)-2-sulfanylidene-1,3...)
Affinity DataIC50: >5.00E+4nM. Assay description: Screening Center: Penn Center for Molecular Discovery Center Affiliation: University of Pennsylvania Network: Molecular Library Screening Center Netw...
In DepthDetails PCBioAssay