BDBM41245 4-fluoranyl-N-[1-(4-methylpiperazin-1-yl)-1-thiophen-2-yl-propan-2-yl]benzenesulfonamide::4-fluoro-N-[1-(4-methyl-1-piperazinyl)-1-thiophen-2-ylpropan-2-yl]benzenesulfonamide::4-fluoro-N-[1-(4-methylpiperazin-1-yl)-1-thiophen-2-ylpropan-2-yl]benzenesulfonamide::4-fluoro-N-[1-methyl-2-(4-methylpiperazin-1-yl)-2-thien-2-ylethyl]benzenesulfonamide::4-fluoro-N-[1-methyl-2-(4-methylpiperazino)-2-(2-thienyl)ethyl]benzenesulfonamide::MLS000092597::SMR000028123::cid_3242269
SMILES CC(NS(=O)(=O)c1ccc(F)cc1)C(N1CCN(C)CC1)c1cccs1
InChI Key InChIKey=KFHQFKCHEVQRDA-UHFFFAOYSA-N
Data  1 IC50
  Tab Delimited (TSV)   2D SDfile   Computed 3D by Vconf -m prep SDfile
Find this compound or compounds like it in BindingDB:
Activity Spreadsheet -- Enzyme Inhibition Constant Data from BindingDB
Found 1 hit for monomerid = 41245
TargetDNA-directed RNA polymerase subunit beta(Escherichia coli)
Pcmd
Curated by PubChem BioAssay
LigandPNGBDBM41245(4-fluoranyl-N-[1-(4-methylpiperazin-1-yl)-1-thioph...)
Affinity DataIC50: >5.00E+4nM. Assay description: Screening Center: Penn Center for Molecular Discovery Center Affiliation: University of Pennsylvania Network: Molecular Library Screening Center Netw...
In DepthDetails PCBioAssay