BDBM41346 2-[(2,4-dichlorophenoxy)methyl]-5-(2,6-dimethyl-4-morpholinyl)-1,3-oxazole-4-carbonitrile::2-[(2,4-dichlorophenoxy)methyl]-5-(2,6-dimethyl-4-morpholinyl)-4-oxazolecarbonitrile::2-[(2,4-dichlorophenoxy)methyl]-5-(2,6-dimethylmorpholin-4-yl)-1,3-oxazole-4-carbonitrile::2-[(2,4-dichlorophenoxy)methyl]-5-(2,6-dimethylmorpholino)oxazole-4-carbonitrile::2-[[2,4-bis(chloranyl)phenoxy]methyl]-5-(2,6-dimethylmorpholin-4-yl)-1,3-oxazole-4-carbonitrile::MLS000065135::SMR000078603::cid_2963508
SMILES CC1CN(CC(C)O1)c1oc(COc2ccc(Cl)cc2Cl)nc1C#N
InChI Key InChIKey=YYDPYCVTMNIQCM-UHFFFAOYSA-N
Data  1 IC50
  Tab Delimited (TSV)   2D SDfile   Computed 3D by Vconf -m prep SDfile
Find this compound or compounds like it in BindingDB:
Activity Spreadsheet -- Enzyme Inhibition Constant Data from BindingDB
Found 1 hit for monomerid = 41346
TargetCathepsin S(Homo sapiens (Human))
Pcmd
Curated by PubChem BioAssay
LigandPNGBDBM41346(2-[(2,4-dichlorophenoxy)methyl]-5-(2,6-dimethyl-4-...)
Affinity DataIC50: >5.00E+4nM. Assay description: Screening Center: Penn Center for Molecular Discovery Center Affiliation: University of Pennsylvania Network: Molecular Library Screening Center Netw...
In DepthDetails PCBioAssay