BDBM41361 MLS000118108::N-[2-[butyl(ethyl)amino]ethyl]-1,5-dimethyl-4-oxidanylidene-pyrrolo[3,2-c]quinoline-2-carboxamide::N-[2-[butyl(ethyl)amino]ethyl]-1,5-dimethyl-4-oxo-2-pyrrolo[3,2-c]quinolinecarboxamide::N-[2-[butyl(ethyl)amino]ethyl]-1,5-dimethyl-4-oxopyrrolo[3,2-c]quinoline-2-carboxamide::N-[2-[butyl(ethyl)amino]ethyl]-4-keto-1,5-dimethyl-pyrrolo[3,2-c]quinoline-2-carboxamide::SMR000095056::cid_5307632
SMILES CCCCN(CC)CCNC(=O)c1cc2c(n1C)c1ccccc1n(C)c2=O
InChI Key InChIKey=QOSIFLWPBHDLAP-UHFFFAOYSA-N
Data  2 IC50
  Tab Delimited (TSV)   2D SDfile   Computed 3D by Vconf -m prep SDfile
Find this compound or compounds like it in BindingDB:
Activity Spreadsheet -- Enzyme Inhibition Constant Data from BindingDB
Found 2 hits for monomerid = 41361
TargetUbiquitin-conjugating enzyme E2 N(Homo sapiens (Human))
Burnham Center For Chemical Genomics
Curated by PubChem BioAssay
LigandPNGBDBM41361(MLS000118108 | N-[2-[butyl(ethyl)amino]ethyl]-1,5-...)
Affinity DataIC50: >2.00E+4nM. Assay description: Data Source: Sanford-Burnham Center for Chemical Genomics (SBCCG) Source Affiliation: Sanford-Burnham Medical Research Institute (SBMRI, San Diego CA...
In DepthDetails PCBioAssay
TargetCathepsin S(Homo sapiens (Human))
Pcmd
Curated by PubChem BioAssay
LigandPNGBDBM41361(MLS000118108 | N-[2-[butyl(ethyl)amino]ethyl]-1,5-...)
Affinity DataIC50:  1.74E+3nM. Assay description: Screening Center: Penn Center for Molecular Discovery Center Affiliation: University of Pennsylvania Network: Molecular Library Screening Center Netw...
In DepthDetails PCBioAssay