BDBM41404 MLS000087096::N-(4-chlorobenzyl)-5-(2-methoxyphenyl)isoxazole-3-carboxamide::N-[(4-chlorophenyl)methyl]-5-(2-methoxyphenyl)-1,2-oxazole-3-carboxamide::N-[(4-chlorophenyl)methyl]-5-(2-methoxyphenyl)-3-isoxazolecarboxamide::SMR000023319::cid_3241352
SMILES COc1ccccc1-c1cc(no1)C(=O)NCc1ccc(Cl)cc1
InChI Key InChIKey=UVAIWSFSLQBPLL-UHFFFAOYSA-N
Data  1 IC50
  Tab Delimited (TSV)   2D SDfile   Computed 3D by Vconf -m prep SDfile
Find this compound or compounds like it in BindingDB:
Activity Spreadsheet -- Enzyme Inhibition Constant Data from BindingDB
Found 1 hit for monomerid = 41404
TargetCathepsin G(Homo sapiens (Human))
Pcmd
Curated by PubChem BioAssay
LigandPNGBDBM41404(MLS000087096 | N-(4-chlorobenzyl)-5-(2-methoxyphen...)
Affinity DataIC50:  1.11E+4nM. Assay description: Screening Center: Penn Center for Molecular Discovery Center Affiliation: University of Pennsylvania Network: Molecular Library Screening Center Netw...
In DepthDetails PCBioAssay