BDBM41429 3-({Benzyl-[1-(tetrahydro-furan-2-ylmethyl)-1H-tetrazol-5-ylmethyl]-amino}-methyl)-6-methoxy-1H-quinolin-2-one::3-[[benzyl-[[1-(oxolan-2-ylmethyl)tetrazol-5-yl]methyl]amino]methyl]-6-methoxy-1H-quinolin-2-one::3-[[benzyl-[[1-(tetrahydrofurfuryl)tetrazol-5-yl]methyl]amino]methyl]-6-methoxy-carbostyril::6-methoxy-3-[[[1-(2-oxolanylmethyl)-5-tetrazolyl]methyl-(phenylmethyl)amino]methyl]-1H-quinolin-2-one::6-methoxy-3-[[[1-(oxolan-2-ylmethyl)-1,2,3,4-tetrazol-5-yl]methyl-(phenylmethyl)amino]methyl]-1H-quinolin-2-one::MLS000072483::SMR000003221::cid_648431
SMILES COc1ccc2[nH]c(=O)c(CN(Cc3nnnn3CC3CCCO3)Cc3ccccc3)cc2c1
InChI Key InChIKey=VCGLWHOZWVVEMQ-UHFFFAOYSA-N
Data  1 IC50
  Tab Delimited (TSV)   2D SDfile   Computed 3D by Vconf -m prep SDfile
Find this compound or compounds like it in BindingDB:
Activity Spreadsheet -- Enzyme Inhibition Constant Data from BindingDB
Found 1 hit for monomerid = 41429
TargetEphrin type-B receptor 4(Homo sapiens (Human))
The Scripps Research Institute Molecular Screening Center
Curated by PubChem BioAssay
LigandPNGBDBM41429(3-({Benzyl-[1-(tetrahydro-furan-2-ylmethyl)-1H-tet...)
Affinity DataIC50: >7.94E+4nM. Assay description: Source (MLSCN Center Name): The Scripps Research Institute Molecular Screening Center Center Affiliation: The Scripps Research Institute, TSRI Assay ...
In DepthDetails PCBioAssay