BDBM414660 US10435405, Example 77::US10934288, Example 77
SMILES Cn1cc(cn1)-c1n[nH]c2cnc(cc12)-c1c(F)cc(NC(=O)CN2CCC2)c(F)c1F
InChI Key InChIKey=MVJWXRCFUFDDKB-UHFFFAOYSA-N
Data  2 KI
  Tab Delimited (TSV)   2D SDfile   Computed 3D by Vconf -m prep SDfile
Find this compound or compounds like it in BindingDB:
Activity Spreadsheet -- Enzyme Inhibition Constant Data from BindingDB
Found 2 hits for monomerid = 414660
TargetMitogen-activated protein kinase kinase kinase kinase 1(Homo sapiens (Human))
Incyte
US Patent
LigandPNGBDBM414660(US10435405, Example 77 | US10934288, Example 77)
Affinity DataKi: <100nM. Assay description: A stock solution of 1 mM test compound was prepared in DMSO. The compound plate was prepared by 3-fold and 11-point serial dilutions. 0.1 μL of ...
Ligand InfoPC cidPC sid
In DepthDetails US Patent
TargetMitogen-activated protein kinase kinase kinase kinase 1(Homo sapiens (Human))
Incyte
US Patent
LigandPNGBDBM414660(US10435405, Example 77 | US10934288, Example 77)
Affinity DataKi: <100nM. Assay description: A stock solution of 1 mM test compound was prepared in DMSO. The compound plate was prepared by 3-fold and 11-point serial dilutions. 0.1 μL of ...
Ligand InfoPC cidPC sid
In DepthDetails US Patent