BDBM41486 2-(3-methoxyphenyl)-2-(4-morpholinyl)acetonitrile::2-(3-methoxyphenyl)-2-morpholin-4-yl-ethanenitrile::2-(3-methoxyphenyl)-2-morpholin-4-ylacetonitrile::2-(3-methoxyphenyl)-2-morpholino-acetonitrile::2-(3-methoxyphenyl)-2-morpholinoacetonitrile::MLS000539861::SMR000125319::cid_3821373
SMILES COc1cccc(c1)C(C#N)N1CCOCC1
InChI Key InChIKey=FGYIFPNWPBUVLI-UHFFFAOYSA-N
Data  1 IC50
  Tab Delimited (TSV)   2D SDfile   Computed 3D by Vconf -m prep SDfile
Find this compound or compounds like it in BindingDB:
Activity Spreadsheet -- Enzyme Inhibition Constant Data from BindingDB
Found 1 hit for monomerid = 41486
TargetEphrin type-B receptor 4(Homo sapiens (Human))
The Scripps Research Institute Molecular Screening Center
Curated by PubChem BioAssay
LigandPNGBDBM41486(2-(3-methoxyphenyl)-2-(4-morpholinyl)acetonitrile ...)
Affinity DataIC50: >7.94E+4nM. Assay description: Source (MLSCN Center Name): The Scripps Research Institute Molecular Screening Center Center Affiliation: The Scripps Research Institute, TSRI Assay ...
In DepthDetails PCBioAssay