BDBM41529 1-(3,4-dimethylphenyl)-3-hydroxy-6,6-dimethyl-3-(trifluoromethyl)-3,5,6,7-tetrahydro-1H-indole-2,4-dione::1-(3,4-dimethylphenyl)-3-hydroxy-6,6-dimethyl-3-(trifluoromethyl)-5,7-dihydroindole-2,4-dione::1-(3,4-dimethylphenyl)-3-hydroxy-6,6-dimethyl-3-(trifluoromethyl)-5,7-dihydroindole-2,4-quinone::1-(3,4-dimethylphenyl)-6,6-dimethyl-3-oxidanyl-3-(trifluoromethyl)-5,7-dihydroindole-2,4-dione::MLS000581854::SMR000200458::cid_2962333
SMILES Cc1ccc(cc1C)N1C2=C(C(=O)CC(C)(C)C2)C(O)(C1=O)C(F)(F)F
InChI Key InChIKey=JDRBLAJQKDGRAV-UHFFFAOYSA-N
Data  1 IC50
  Tab Delimited (TSV)   2D SDfile   Computed 3D by Vconf -m prep SDfile
Find this compound or compounds like it in BindingDB:
Activity Spreadsheet -- Enzyme Inhibition Constant Data from BindingDB
Found 1 hit for monomerid = 41529
TargetEphrin type-B receptor 4(Homo sapiens (Human))
The Scripps Research Institute Molecular Screening Center
Curated by PubChem BioAssay
LigandPNGBDBM41529(1-(3,4-dimethylphenyl)-3-hydroxy-6,6-dimethyl-3-(t...)
Affinity DataIC50: >7.94E+4nM. Assay description: Source (MLSCN Center Name): The Scripps Research Institute Molecular Screening Center Center Affiliation: The Scripps Research Institute, TSRI Assay ...
In DepthDetails PCBioAssay