BDBM416421 (R)-2-(3-(difluoromethoxy)benzyl)-1-ethyl-N-(1-(5-(ethylsulfonyl)pyridin-2-yl)-2-hydroxyethyl)-1H-indole-5-carboxamide::US10301261, Compound IN-7::US10829448, Compound IN-7
SMILES CCn1c(Cc2cccc(OC(F)F)c2)cc2cc(ccc12)C(=O)N[C@@H](CO)c1ccc(cn1)S(=O)(=O)CC
InChI Key InChIKey=BXQISTLCESRECG-VWLOTQADSA-N
Data  2 KI  1 IC50
  Tab Delimited (TSV)   2D SDfile   Computed 3D by Vconf -m prep SDfile
Find this compound or compounds like it in BindingDB:
Activity Spreadsheet -- Enzyme Inhibition Constant Data from BindingDB
Found 3 hits for monomerid = 416421
TargetNuclear receptor ROR-gamma(Homo sapiens (Human))
Vitae Pharmaceuticals
US Patent
LigandPNGBDBM416421((R)-2-(3-(difluoromethoxy)benzyl)-1-ethyl-N-(1-(5-...)
Affinity DataKi: <100nM. Assay description: Compounds described herein were tested for ability to bind to RORγ in a cell-free competition assay with commercially available radio-ligand (RL...
Ligand InfoPC cidPC sid
In DepthDetails US Patent
TargetNuclear receptor ROR-gamma(Homo sapiens (Human))
Vitae Pharmaceuticals
US Patent
LigandPNGBDBM416421((R)-2-(3-(difluoromethoxy)benzyl)-1-ethyl-N-(1-(5-...)
Affinity DataKi: <100nM. Assay description: Compounds described herein were tested for ability to bind to RORγ in a cell-free competition assay with commercially available radio-ligand (RL...
Ligand InfoPC cidPC sid
In DepthDetails US Patent
TargetNuclear receptor ROR-gamma(Homo sapiens (Human))
Vitae Pharmaceuticals
US Patent
LigandPNGBDBM416421((R)-2-(3-(difluoromethoxy)benzyl)-1-ethyl-N-(1-(5-...)
Affinity DataIC50:  550nM. Assay description: Compounds described herein were tested for RORγ inverse agonist activity in a cell-based, transcriptional activity assay. Secreted NanolucŪ luci...
Ligand InfoPC cidPC sid
In DepthDetails US Patent