BDBM416458 (R)-2-((3,3-difluorocyclobutyl)methoxy)-1-ethyl-N-(1-(4-(ethylsulfonyl)phenyl)-2-hydroxyethyl)-1H-benzo[d]imidazole-5-carboxamide::US10301261, Compound BE-13::US10829448, Compound BE-13
SMILES CCn1c(OCC2CC(F)(F)C2)nc2cc(ccc12)C(=O)N[C@@H](CO)c1ccc(cc1)S(=O)(=O)CC
InChI Key InChIKey=CCMKJDRCILMNMQ-NRFANRHFSA-N
Data  2 KI  1 IC50
  Tab Delimited (TSV)   2D SDfile   Computed 3D by Vconf -m prep SDfile
Find this compound or compounds like it in BindingDB:
Activity Spreadsheet -- Enzyme Inhibition Constant Data from BindingDB
Found 3 hits for monomerid = 416458
TargetNuclear receptor ROR-gamma(Homo sapiens (Human))
Vitae Pharmaceuticals
US Patent
LigandPNGBDBM416458((R)-2-((3,3-difluorocyclobutyl)methoxy)-1-ethyl-N-...)
Affinity DataKi: <100nM. Assay description: Compounds described herein were tested for ability to bind to RORγ in a cell-free competition assay with commercially available radio-ligand (RL...
Ligand InfoPC cidPC sid
In DepthDetails US Patent
TargetNuclear receptor ROR-gamma(Homo sapiens (Human))
Vitae Pharmaceuticals
US Patent
LigandPNGBDBM416458((R)-2-((3,3-difluorocyclobutyl)methoxy)-1-ethyl-N-...)
Affinity DataKi: <100nM. Assay description: Compounds described herein were tested for ability to bind to RORγ in a cell-free competition assay with commercially available radio-ligand (RL...
Ligand InfoPC cidPC sid
In DepthDetails US Patent
TargetNuclear receptor ROR-gamma(Homo sapiens (Human))
Vitae Pharmaceuticals
US Patent
LigandPNGBDBM416458((R)-2-((3,3-difluorocyclobutyl)methoxy)-1-ethyl-N-...)
Affinity DataIC50: >1.00E+3nM. Assay description: Compounds described herein were tested for RORγ inverse agonist activity in a cell-based, transcriptional activity assay. Secreted NanolucŪ luci...
Ligand InfoPC cidPC sid
In DepthDetails US Patent