BDBM416461 (R)-1-cyclopropyl-2-((4,4-difluorocyclohexyl)methoxy)-N-(1-(4-(ethylsulfonyl)phenyl)-2-hydroxyethyl)-1H-benzo[d]imidazole-5-carboxamide::US10301261, Compound BE-16::US10829448, Compound BE-16
SMILES CCS(=O)(=O)c1ccc(cc1)[C@H](CO)NC(=O)c1ccc2n(C3CC3)c(OCC3CCC(F)(F)CC3)nc2c1
InChI Key InChIKey=SWUMZQYMSDDTBN-DEOSSOPVSA-N
Data  2 KI  1 IC50
  Tab Delimited (TSV)   2D SDfile   Computed 3D by Vconf -m prep SDfile
Find this compound or compounds like it in BindingDB:
Activity Spreadsheet -- Enzyme Inhibition Constant Data from BindingDB
Found 3 hits for monomerid = 416461
TargetNuclear receptor ROR-gamma(Homo sapiens (Human))
Vitae Pharmaceuticals
US Patent
LigandPNGBDBM416461((R)-1-cyclopropyl-2-((4,4-difluorocyclohexyl)metho...)
Affinity DataKi: <100nM. Assay description: Compounds described herein were tested for ability to bind to RORγ in a cell-free competition assay with commercially available radio-ligand (RL...
Ligand InfoPC cidPC sid
In DepthDetails US Patent
TargetNuclear receptor ROR-gamma(Homo sapiens (Human))
Vitae Pharmaceuticals
US Patent
LigandPNGBDBM416461((R)-1-cyclopropyl-2-((4,4-difluorocyclohexyl)metho...)
Affinity DataKi: <100nM. Assay description: Compounds described herein were tested for ability to bind to RORγ in a cell-free competition assay with commercially available radio-ligand (RL...
Ligand InfoPC cidPC sid
In DepthDetails US Patent
TargetNuclear receptor ROR-gamma(Homo sapiens (Human))
Vitae Pharmaceuticals
US Patent
LigandPNGBDBM416461((R)-1-cyclopropyl-2-((4,4-difluorocyclohexyl)metho...)
Affinity DataIC50: <100nM. Assay description: Compounds described herein were tested for RORγ inverse agonist activity in a cell-based, transcriptional activity assay. Secreted NanolucŪ luci...
Ligand InfoPC cidPC sid
In DepthDetails US Patent