BDBM416463 1-cyclopropyl-N-(4-(ethylsulfonyl)benzyl)-2-(((1r,4r)-4-(trifluoromethyl)cyclohexyl)methyl)-1H-benzo[d]imidazole-5-carboxamide1-cyclopropyl-N-(4-(ethylsulfonyl)benzyl)-2-(((1s,4s)-4-(trifluoromethyl)cyclohexyl)methyl)-1H-benzo[d]imidazole-5-carboxamide::US10301261, Compound BE-18.1::US10301261, Compound BE-18.2::US10829448, Compound BE-18.2
SMILES CCS(=O)(=O)c1ccc(CNC(=O)c2ccc3n(C4CC4)c(C[C@H]4CC[C@@H](CC4)C(F)(F)F)nc3c2)cc1
InChI Key InChIKey=RRASGYKNSXOTBM-XGAFWQRZSA-N
Data  4 KI  2 IC50
  Tab Delimited (TSV)   2D SDfile   Computed 3D by Vconf -m prep SDfile
Find this compound or compounds like it in BindingDB:
Activity Spreadsheet -- Enzyme Inhibition Constant Data from BindingDB
Found 6 hits for monomerid = 416463
TargetNuclear receptor ROR-gamma(Homo sapiens (Human))
Vitae Pharmaceuticals
US Patent
LigandPNGBDBM416463(1-cyclopropyl-N-(4-(ethylsulfonyl)benzyl)-2-(((1r,...)
Affinity DataKi: <100nM. Assay description: Compounds described herein were tested for ability to bind to RORγ in a cell-free competition assay with commercially available radio-ligand (RL...
Ligand InfoPC cidPC sid
In DepthDetails US Patent
TargetNuclear receptor ROR-gamma(Homo sapiens (Human))
Vitae Pharmaceuticals
US Patent
LigandPNGBDBM416463(1-cyclopropyl-N-(4-(ethylsulfonyl)benzyl)-2-(((1r,...)
Affinity DataKi: <100nM. Assay description: Compounds described herein were tested for ability to bind to RORγ in a cell-free competition assay with commercially available radio-ligand (RL...
Ligand InfoPC cidPC sid
In DepthDetails US Patent
TargetNuclear receptor ROR-gamma(Homo sapiens (Human))
Vitae Pharmaceuticals
US Patent
LigandPNGBDBM416463(1-cyclopropyl-N-(4-(ethylsulfonyl)benzyl)-2-(((1r,...)
Affinity DataKi: <100nM. Assay description: Compounds described herein were tested for ability to bind to RORγ in a cell-free competition assay with commercially available radio-ligand (RL...
Ligand InfoPC cidPC sid
In DepthDetails US Patent
TargetNuclear receptor ROR-gamma(Homo sapiens (Human))
Vitae Pharmaceuticals
US Patent
LigandPNGBDBM416463(1-cyclopropyl-N-(4-(ethylsulfonyl)benzyl)-2-(((1r,...)
Affinity DataKi: <100nM. Assay description: Compounds described herein were tested for ability to bind to RORγ in a cell-free competition assay with commercially available radio-ligand (RL...
Ligand InfoPC cidPC sid
In DepthDetails US Patent
TargetNuclear receptor ROR-gamma(Homo sapiens (Human))
Vitae Pharmaceuticals
US Patent
LigandPNGBDBM416463(1-cyclopropyl-N-(4-(ethylsulfonyl)benzyl)-2-(((1r,...)
Affinity DataIC50: >1.00E+3nM. Assay description: Compounds described herein were tested for RORγ inverse agonist activity in a cell-based, transcriptional activity assay. Secreted NanolucŪ luci...
Ligand InfoPC cidPC sid
In DepthDetails US Patent
TargetNuclear receptor ROR-gamma(Homo sapiens (Human))
Vitae Pharmaceuticals
US Patent
LigandPNGBDBM416463(1-cyclopropyl-N-(4-(ethylsulfonyl)benzyl)-2-(((1r,...)
Affinity DataIC50: <100nM. Assay description: Compounds described herein were tested for RORγ inverse agonist activity in a cell-based, transcriptional activity assay. Secreted NanolucŪ luci...
Ligand InfoPC cidPC sid
In DepthDetails US Patent