BDBM41653 1-(2-pyridinyl)-3-thiophen-2-ylurea::1-(2-pyridyl)-3-(2-thienyl)urea::1-pyridin-2-yl-3-thiophen-2-yl-urea::1-pyridin-2-yl-3-thiophen-2-ylurea::MLS000093554::N-pyridin-2-yl-N'-thien-2-ylurea::SMR000029172::cid_3243340
SMILES O=C(Nc1cccs1)Nc1ccccn1
InChI Key InChIKey=QIVDAOQCRJAZMX-UHFFFAOYSA-N
Data  1 IC50  3 EC50
  Tab Delimited (TSV)   2D SDfile   Computed 3D by Vconf -m prep SDfile
Find this compound or compounds like it in BindingDB:
Activity Spreadsheet -- Enzyme Inhibition Constant Data from BindingDB
Found 4 hits for monomerid = 41653
TargetSphingosine 1-phosphate receptor 2(Homo sapiens (Human))
The Scripps Research Institute Molecular Screening Center
Curated by PubChem BioAssay
LigandPNGBDBM41653(1-(2-pyridinyl)-3-thiophen-2-ylurea | 1-(2-pyridyl...)
Affinity DataEC50: >5.00E+4nM. Assay description: Source (MLSCN Center Name): The Scripps Research Institute Molecular Screening Center Center Affiliation: The Scripps Research Institute (TSRI) Assay...
In DepthDetails PCBioAssay
TargetGlycogen synthase kinase-3 beta(Homo sapiens (Human))
Broad Institute
Curated by PubChem BioAssay
LigandPNGBDBM41653(1-(2-pyridinyl)-3-thiophen-2-ylurea | 1-(2-pyridyl...)
Affinity DataEC50: >3.00E+5nM. Assay description: Keywords: GSK3beta, dose response, kinase, inhibition, HTS Assay Overview: The glycogen synthase kinase-3 beta (GSK-3b) is a known master regulator f...
In DepthDetails PCBioAssay
TargetM1 family aminopeptidase(Plasmodium falciparum (isolate FcB1 / Columbia))
Srmlsc
Curated by PubChem BioAssay
LigandPNGBDBM41653(1-(2-pyridinyl)-3-thiophen-2-ylurea | 1-(2-pyridyl...)
Affinity DataIC50:  6.18E+4nM. Assay description: Southern Research Molecular Libraries Screening Center (SRMLSC) Southern Research Institute (Birmingham, Alabama) NIH Molecular Libraries Screening...
In DepthDetails PCBioAssay
TargetSphingosine 1-phosphate receptor 2(Homo sapiens (Human))
The Scripps Research Institute Molecular Screening Center
Curated by PubChem BioAssay
LigandPNGBDBM41653(1-(2-pyridinyl)-3-thiophen-2-ylurea | 1-(2-pyridyl...)
Affinity DataEC50: >5.00E+4nM. Assay description: Source (MLSCN Center Name): The Scripps Research Institute Molecular Screening Center Center Affiliation: The Scripps Research Institute (TSRI) Assay...
In DepthDetails PCBioAssay