BDBM41693 3'-[2-(1-benzyl-2,5-dimethylpyrrol-3-yl)-2-oxoethyl]spiro[1,2-dihydroindene-3,5'-imidazolidine]-2',4'-dione::3'-[2-[2,5-dimethyl-1-(phenylmethyl)-3-pyrrolyl]-2-oxoethyl]spiro[1,2-dihydroindene-3,5'-imidazolidine]-2',4'-dione::3'-[2-[2,5-dimethyl-1-(phenylmethyl)pyrrol-3-yl]-2-oxidanylidene-ethyl]spiro[1,2-dihydroindene-3,5'-imidazolidine]-2',4'-dione::3-[2-(1-benzyl-2,5-dimethyl-pyrrol-3-yl)-2-keto-ethyl]spiro[imidazolidine-5,1'-indane]-2,4-quinone::SR-01000759076-1::cid_4781524
SMILES Cc1cc(C(=O)CN2C(=O)NC3(CCc4ccccc34)C2=O)c(C)n1Cc1ccccc1
InChI Key InChIKey=JGXVEFSBVPQLIL-UHFFFAOYSA-N
Data  2 EC50
  Tab Delimited (TSV)   2D SDfile   Computed 3D by Vconf -m prep SDfile
Find this compound or compounds like it in BindingDB:
Activity Spreadsheet -- Enzyme Inhibition Constant Data from BindingDB
Found 2 hits for monomerid = 41693
TargetSphingosine 1-phosphate receptor 2(Homo sapiens (Human))
The Scripps Research Institute Molecular Screening Center
Curated by PubChem BioAssay
LigandPNGBDBM41693(3'-[2-(1-benzyl-2,5-dimethylpyrrol-3-yl)-2-oxoethy...)
Affinity DataEC50: >4.40E+4nM. Assay description: Source (MLSCN Center Name): The Scripps Research Institute Molecular Screening Center Center Affiliation: The Scripps Research Institute (TSRI) Assay...
In DepthDetails PCBioAssay
TargetSphingosine 1-phosphate receptor 2(Homo sapiens (Human))
The Scripps Research Institute Molecular Screening Center
Curated by PubChem BioAssay
LigandPNGBDBM41693(3'-[2-(1-benzyl-2,5-dimethylpyrrol-3-yl)-2-oxoethy...)
Affinity DataEC50: >3.00E+4nM. Assay description: Source (MLSCN Center Name): The Scripps Research Institute Molecular Screening Center Center Affiliation: The Scripps Research Institute (TSRI) Assay...
In DepthDetails PCBioAssay