BDBM41763 (5E)-1-(4-methylphenyl)-5-[(2-morpholin-4-ylethylamino)methylidene]-1,3-diazinane-2,4,6-trione::(5E)-1-(4-methylphenyl)-5-[[2-(4-morpholinyl)ethylamino]methylidene]-1,3-diazinane-2,4,6-trione::(5E)-5-[(2-morpholinoethylamino)methylene]-1-(p-tolyl)barbituric acid::MLS000036795::SMR000040602::cid_5389133
SMILES Cc1ccc(cc1)-n1c(O)c(C=NCCN2CCOCC2)c(=O)[nH]c1=O
InChI Key InChIKey=KJUSUBNBSAGLQB-UHFFFAOYSA-N
Data  1 IC50  2 EC50
  Tab Delimited (TSV)   2D SDfile   Computed 3D by Vconf -m prep SDfile
Find this compound or compounds like it in BindingDB:
Activity Spreadsheet -- Enzyme Inhibition Constant Data from BindingDB
Found 3 hits for monomerid = 41763
TargetSerine/threonine-protein kinase PLK1(Homo sapiens (Human))
University Of Pittsburgh
Curated by PubChem BioAssay
LigandPNGBDBM41763((5E)-1-(4-methylphenyl)-5-[(2-morpholin-4-ylethyla...)
Affinity DataEC50: >5.00E+4nM. Assay description: List of compounds to be tested: Compounds that met the active criterion of Z-score is
In DepthDetails PCBioAssay
TargetSerine/threonine-protein kinase PLK1(Homo sapiens (Human))
University Of Pittsburgh
Curated by PubChem BioAssay
LigandPNGBDBM41763((5E)-1-(4-methylphenyl)-5-[(2-morpholin-4-ylethyla...)
Affinity DataEC50: >5.00E+4nM. Assay description: List of compounds to be tested: Compounds that met the active criterion of Z-score is
In DepthDetails PCBioAssay
TargetSerine/threonine-protein kinase PLK1(Homo sapiens (Human))
University Of Pittsburgh
Curated by PubChem BioAssay
LigandPNGBDBM41763((5E)-1-(4-methylphenyl)-5-[(2-morpholin-4-ylethyla...)
Affinity DataIC50: >5.00E+4nM. Assay description: List of compounds to be tested: Compounds that met the active criterion of Z-score is
In DepthDetails PCBioAssay