BDBM41771 MLS000057041::N-(6,7,8,9-tetrahydro-5H-[1,2,4]triazolo[4,3-a]azepin-3-ylmethyl)aniline::SMR000060400::cid_2310790::phenyl(6,7,8,9-tetrahydro-5H-[1,2,4]triazol[4,3-a]azepin-3-ylmethyl)amine
SMILES C(Nc1ccccc1)c1nnc2CCCCCn12
InChI Key InChIKey=OOJNELXWRKRYSI-UHFFFAOYSA-N
Data  1 IC50  2 EC50
  Tab Delimited (TSV)   2D SDfile   Computed 3D by Vconf -m prep SDfile
Find this compound or compounds like it in BindingDB:
Activity Spreadsheet -- Enzyme Inhibition Constant Data from BindingDB
Found 3 hits for monomerid = 41771
TargetSerine/threonine-protein kinase PLK1(Homo sapiens (Human))
University Of Pittsburgh
Curated by PubChem BioAssay
LigandPNGBDBM41771(MLS000057041 | N-(6,7,8,9-tetrahydro-5H-[1,2,4]tri...)
Affinity DataEC50: >5.00E+4nM. Assay description: List of compounds to be tested: Compounds that met the active criterion of Z-score is
In DepthDetails PCBioAssay
TargetSerine/threonine-protein kinase PLK1(Homo sapiens (Human))
University Of Pittsburgh
Curated by PubChem BioAssay
LigandPNGBDBM41771(MLS000057041 | N-(6,7,8,9-tetrahydro-5H-[1,2,4]tri...)
Affinity DataEC50: >5.00E+4nM. Assay description: List of compounds to be tested: Compounds that met the active criterion of Z-score is
In DepthDetails PCBioAssay
TargetSerine/threonine-protein kinase PLK1(Homo sapiens (Human))
University Of Pittsburgh
Curated by PubChem BioAssay
LigandPNGBDBM41771(MLS000057041 | N-(6,7,8,9-tetrahydro-5H-[1,2,4]tri...)
Affinity DataIC50: >5.00E+4nM. Assay description: List of compounds to be tested: Compounds that met the active criterion of Z-score is
In DepthDetails PCBioAssay