BDBM418323 US10457672, Compound 69
SMILES FC(F)(F)c1cccc(c1)C(=O)CCC(=O)c1ccc2OCCCc2c1
InChI Key InChIKey=YEULEMVKCTZHDK-UHFFFAOYSA-N
Data  1 EC50
  Tab Delimited (TSV)   2D SDfile   Computed 3D by Vconf -m prep SDfile
Find this compound or compounds like it in BindingDB:
Activity Spreadsheet -- Enzyme Inhibition Constant Data from BindingDB
Found 1 hit for monomerid = 418323
TargetCatenin beta-1/Protein Wnt-3a(Homo sapiens (Human))
Samumed
US Patent
LigandPNGBDBM418323(US10457672, Compound 69)
Affinity DataEC50: >1.00E+4nM. Assay description: Compounds that enhance the Wnt activity, or Activators, were assayed as follows. Reporter cell lines were generated by stably transducing cells of co...
Ligand InfoPC cidPC sid
In DepthDetails US Patent