BDBM41859 3-(4-chlorophenyl)-1H-pyrazole-5-carboxylic acid ethyl ester::MLS-0111582.0001::cid_619485::ethyl 3-(4-chlorophenyl)-1H-pyrazole-5-carboxylate
SMILES CCOC(=O)c1cc(n[nH]1)-c1ccc(Cl)cc1
InChI Key InChIKey=AAXKEDUSKXDFJA-UHFFFAOYSA-N
Data  2 IC50
  Tab Delimited (TSV)   2D SDfile   Computed 3D by Vconf -m prep SDfile
Find this compound or compounds like it in BindingDB:
Activity Spreadsheet -- Enzyme Inhibition Constant Data from BindingDB
Found 2 hits for monomerid = 41859
TargetAlkaline phosphatase, tissue-nonspecific isozyme(Homo sapiens (Human))
Burnham Center For Chemical Genomics
Curated by PubChem BioAssay
LigandPNGBDBM41859(3-(4-chlorophenyl)-1H-pyrazole-5-carboxylic acid e...)
Affinity DataIC50:  2.35E+3nM. Assay description: Sanford-Burnham Center for Chemical Genomics (SBCCG) Sanford-Burnham Medical Research Institute (SBMRI, San Diego, CA) NIH Molecular Libraries Screen...
In DepthDetails PCBioAssay
TargetAlkaline phosphatase, germ cell type(Homo sapiens (Human))
Sanford-Burnham Center For Chemical Genomics
Curated by PubChem BioAssay
LigandPNGBDBM41859(3-(4-chlorophenyl)-1H-pyrazole-5-carboxylic acid e...)
Affinity DataIC50: >1.00E+5nM. Assay description: Data Source: Sanford-Burnham Center for Chemical Genomics (SBCCG) Source Affiliation: Sanford-Burnham Medical Research Institute (SBMRI, San Diego, C...
In DepthDetails PCBioAssay