BDBM41901 1-Pyrimidin-2-yl-piperidine-4-carboxylic acid (4-phenoxy-phenyl)-amide::MLS000073870::N-(4-phenoxyphenyl)-1-(2-pyrimidinyl)-4-piperidinecarboxamide::N-(4-phenoxyphenyl)-1-(2-pyrimidyl)isonipecotamide::N-(4-phenoxyphenyl)-1-pyrimidin-2-yl-piperidine-4-carboxamide::N-(4-phenoxyphenyl)-1-pyrimidin-2-ylpiperidine-4-carboxamide::SMR000006977::cid_652265
SMILES O=C(Nc1ccc(Oc2ccccc2)cc1)C1CCN(CC1)c1ncccn1
InChI Key InChIKey=SPEUPCBWEHYOSO-UHFFFAOYSA-N
Data  1 IC50
  Tab Delimited (TSV)   2D SDfile   Computed 3D by Vconf -m prep SDfile
Find this compound or compounds like it in BindingDB:
Activity Spreadsheet -- Enzyme Inhibition Constant Data from BindingDB
Found 1 hit for monomerid = 41901
TargetBifunctional epoxide hydrolase 2(Homo sapiens (Human))
Columbia University Molecular Screening Center
Curated by PubChem BioAssay
LigandPNGBDBM41901(1-Pyrimidin-2-yl-piperidine-4-carboxylic acid (4-p...)
Affinity DataIC50:  189nM. Assay description: Data Source: Columbia University Molecular Screening Center Source (MLSCN Center Name): Columbia University Molecular Screening Center Center Affilia...
In DepthDetails PCBioAssay