BDBM41924 MLS000520741::N-(2-chlorobenzyl)-4-keto-3-[3-(2-ketopyrrolidino)propyl]-2-thioxo-1H-quinazoline-7-carboxamide::N-[(2-chlorophenyl)methyl]-4-oxidanylidene-3-[3-(2-oxidanylidenepyrrolidin-1-yl)propyl]-2-sulfanylidene-1H-quinazoline-7-carboxamide::N-[(2-chlorophenyl)methyl]-4-oxo-3-[3-(2-oxo-1-pyrrolidinyl)propyl]-2-sulfanylidene-1H-quinazoline-7-carboxamide::N-[(2-chlorophenyl)methyl]-4-oxo-3-[3-(2-oxopyrrolidin-1-yl)propyl]-2-sulfanylidene-1H-quinazoline-7-carboxamide::SMR000131151::cid_4284309
SMILES Clc1ccccc1CNC(=O)c1ccc2c(c1)[nH]c(=S)n(CCCN1CCCC1=O)c2=O
InChI Key InChIKey=XXGCWGYNHQHVLF-UHFFFAOYSA-N
Data  1 IC50
  Tab Delimited (TSV)   2D SDfile   Computed 3D by Vconf -m prep SDfile
Find this compound or compounds like it in BindingDB:
Activity Spreadsheet -- Enzyme Inhibition Constant Data from BindingDB
Found 1 hit for monomerid = 41924
TargetBifunctional epoxide hydrolase 2(Homo sapiens (Human))
Columbia University Molecular Screening Center
Curated by PubChem BioAssay
LigandPNGBDBM41924(MLS000520741 | N-(2-chlorobenzyl)-4-keto-3-[3-(2-k...)
Affinity DataIC50:  17.3nM. Assay description: Data Source: Columbia University Molecular Screening Center Source (MLSCN Center Name): Columbia University Molecular Screening Center Center Affilia...
In DepthDetails PCBioAssay