BDBM42009 3-[4-(4-naphthalen-1-ylpiperazin-1-yl)-4-oxidanylidene-butyl]-2-sulfanylidene-1H-quinazolin-4-one::3-[4-(4-naphthalen-1-ylpiperazin-1-yl)-4-oxobutyl]-2-sulfanylidene-1H-quinazolin-4-one::3-[4-[4-(1-naphthalenyl)-1-piperazinyl]-4-oxobutyl]-2-sulfanylidene-1H-quinazolin-4-one::3-[4-keto-4-[4-(1-naphthyl)piperazino]butyl]-2-thioxo-1H-quinazolin-4-one::AS-924-39b::cid_24178257
SMILES O=C(CCCn1c(=S)[nH]c2ccccc2c1=O)N1CCN(CC1)c1cccc2ccccc12
InChI Key InChIKey=SQEOCDCEFUONBC-UHFFFAOYSA-N
Data  1 IC50
  Tab Delimited (TSV)   2D SDfile   Computed 3D by Vconf -m prep SDfile
Find this compound or compounds like it in BindingDB:
Activity Spreadsheet -- Enzyme Inhibition Constant Data from BindingDB
Found 1 hit for monomerid = 42009
TargetEstrogen receptor(Homo sapiens (Human))
Emory University
Curated by PubChem BioAssay
LigandPNGBDBM42009(3-[4-(4-naphthalen-1-ylpiperazin-1-yl)-4-oxidanyli...)
Affinity DataIC50:  70nM. Assay description: NIH Molecular Libraries Screening Centers Network [MLSCN] Emory Chemical Biology Discovery Center in MLSCN Assay provider: John A. Katzenellenbogen, ...
In DepthDetails PCBioAssay