BDBM42071 MLS-0111919.0001::N-(5-pentan-3-yl-1,3,4-thiadiazol-2-yl)-2-thiophen-2-yl-ethanamide::N-(5-pentan-3-yl-1,3,4-thiadiazol-2-yl)-2-thiophen-2-ylacetamide::N-[5-(1-ethylpropyl)-1,3,4-thiadiazol-2-yl]-2-(2-thienyl)acetamide::cid_976017
SMILES CCC(CC)c1nnc(NC(=O)Cc2cccs2)s1
InChI Key InChIKey=MGNLRFMKYVMKJF-UHFFFAOYSA-N
Data  2 IC50
  Tab Delimited (TSV)   2D SDfile   Computed 3D by Vconf -m prep SDfile
Find this compound or compounds like it in BindingDB:
Activity Spreadsheet -- Enzyme Inhibition Constant Data from BindingDB
Found 2 hits for monomerid = 42071
TargetTyrosine-protein phosphatase non-receptor type 7(Homo sapiens (Human))
Burnham Center For Chemical Genomics
Curated by PubChem BioAssay
LigandPNGBDBM42071(MLS-0111919.0001 | N-(5-pentan-3-yl-1,3,4-thiadiaz...)
Affinity DataIC50: >1.00E+5nM. Assay description: Data Source: Sanford-Burnham Center for Chemical Genomics (SBCCG) Source Affiliation: Sanford-Burnham Medical Research Institute (SBMRI, San Diego, C...
In DepthDetails PCBioAssay
TargetGlyceraldehyde-3-phosphate dehydrogenase(Homo sapiens (Human))
Sanford-Burnham Center For Chemical Genomics
Curated by PubChem BioAssay
LigandPNGBDBM42071(MLS-0111919.0001 | N-(5-pentan-3-yl-1,3,4-thiadiaz...)
Affinity DataIC50:  9.97E+4nM. Assay description: Data Source: Sanford-Burnham Center for Chemical Genomics (SBCCG) Source Affiliation: Sanford-Burnham Medical Research Institute (SBMRI, San Diego, C...
In DepthDetails PCBioAssay