BDBM42088 4-(3-nitrophenyl)-3a,4,5,9b-tetrahydro-3H-cyclopenta[c]quinoline-8-carboxylic acid::BIM-0021252.P001::cid_2771382
SMILES OC(=O)c1ccc2NC(C3CC=CC3c2c1)c1cccc(c1)[N+]([O-])=O
InChI Key InChIKey=LHSUTBGPVJHKPC-UHFFFAOYSA-N
Data  1 EC50
  Tab Delimited (TSV)   2D SDfile   Computed 3D by Vconf -m prep SDfile
Find this compound or compounds like it in BindingDB:
Activity Spreadsheet -- Enzyme Inhibition Constant Data from BindingDB
Found 1 hit for monomerid = 42088
TargetNuclear receptor subfamily 4 group A member 1(Homo sapiens (Human))
Sanford-Burnham Center For Chemical Genomics
Curated by PubChem BioAssay
LigandPNGBDBM42088(4-(3-nitrophenyl)-3a,4,5,9b-tetrahydro-3H-cyclopen...)
Affinity DataEC50:  1.75E+3nM. Assay description: Data Source: Sanford-Burnham Center for Chemical Genomics (SBCCG) Source Affiliation: Sanford-Burnham Medical Research Institute (SBMRI, San Diego, C...
In DepthDetails PCBioAssay