BDBM42287 1-Cyclopentyl-4-{3-methyl-1-[1-(tetrahydro-furan-2-ylmethyl)-1H-tetrazol-5-yl]-butyl}-piperazine::1-cyclopentyl-4-[3-methyl-1-[1-(2-oxolanylmethyl)-5-tetrazolyl]butyl]piperazine;hydrochloride::1-cyclopentyl-4-[3-methyl-1-[1-(oxolan-2-ylmethyl)-1,2,3,4-tetrazol-5-yl]butyl]piperazine;hydrochloride::1-cyclopentyl-4-[3-methyl-1-[1-(oxolan-2-ylmethyl)tetrazol-5-yl]butyl]piperazine;hydrochloride::1-cyclopentyl-4-[3-methyl-1-[1-(tetrahydrofurfuryl)tetrazol-5-yl]butyl]piperazine;hydrochloride::MLS000029931::SMR000004939::cid_6602653
SMILES CC(C)CC(N1CCN(CC1)C1CCCC1)c1nnnn1CC1CCCO1
InChI Key InChIKey=WXHLEJHCXOGUNW-UHFFFAOYSA-N
Data  1 EC50
  Tab Delimited (TSV)   2D SDfile   Computed 3D by Vconf -m prep SDfile
Find this compound or compounds like it in BindingDB:
Activity Spreadsheet -- Enzyme Inhibition Constant Data from BindingDB
Found 1 hit for monomerid = 42287
TargetLysosomal acid glucosylceramidase(Homo sapiens (Human))
The Scripps Research Institute Molecular Screening Center
Curated by PubChem BioAssay
LigandPNGBDBM42287(1-Cyclopentyl-4-{3-methyl-1-[1-(tetrahydro-furan-2...)
Affinity DataEC50: >5.00E+4nM. Assay description: Source (MLSCN Center Name): The Scripps Research Institute Molecular Screening Center Center Affiliation: The Scripps Research Institute, TSRI Assay ...
In DepthDetails PCBioAssay