BDBM42308 2-[2-oxidanylidene-3-[(4-oxidanylidene-6-propyl-1H-pyrimidin-2-yl)sulfanyl]propyl]sulfanyl-6-propyl-1H-pyrimidin-4-one::2-[2-oxo-3-[(4-oxo-6-propyl-1H-pyrimidin-2-yl)sulfanyl]propyl]sulfanyl-6-propyl-1H-pyrimidin-4-one::2-[[2-keto-3-[(4-keto-6-propyl-1H-pyrimidin-2-yl)thio]propyl]thio]-6-propyl-1H-pyrimidin-4-one::2-[[2-oxo-3-[(4-oxo-6-propyl-1H-pyrimidin-2-yl)thio]propyl]thio]-6-propyl-1H-pyrimidin-4-one::MLS000057786::SMR000061797::cid_2402619
SMILES CCCc1cc(=O)[nH]c(SCC(=O)CSc2nc(CCC)cc(=O)[nH]2)n1
InChI Key InChIKey=RAFHALUWXUJNGM-UHFFFAOYSA-N
Data  1 EC50
  Tab Delimited (TSV)   2D SDfile   Computed 3D by Vconf -m prep SDfile
Find this compound or compounds like it in BindingDB:
Activity Spreadsheet -- Enzyme Inhibition Constant Data from BindingDB
Found 1 hit for monomerid = 42308
TargetLysosomal acid glucosylceramidase(Homo sapiens (Human))
The Scripps Research Institute Molecular Screening Center
Curated by PubChem BioAssay
LigandPNGBDBM42308(2-[2-oxidanylidene-3-[(4-oxidanylidene-6-propyl-1H...)
Affinity DataEC50: >5.00E+4nM. Assay description: Source (MLSCN Center Name): The Scripps Research Institute Molecular Screening Center Center Affiliation: The Scripps Research Institute, TSRI Assay ...
In DepthDetails PCBioAssay