BDBM42359 2-isopropyl-N~7~-(3-methoxyphenyl)-N~3~-(2-methylcyclohexyl)-1-oxo-1,2,3,6,7,7a-hexahydro-3a,6-epoxyisoindole-3,7-dicarboxamide::MLS000086274::SMR000021783::cid_3243229
SMILES [H]C12OC3(C=C1)C(C2C(=O)Nc1cccc(OC)c1)C(=O)N(C(C)C)C3C(=O)NC1CCCCC1C
InChI Key InChIKey=RZFCFNKCEHOXSQ-UHFFFAOYSA-N
Data  1 EC50
  Tab Delimited (TSV)   2D SDfile   Computed 3D by Vconf -m prep SDfile
Find this compound or compounds like it in BindingDB:
Activity Spreadsheet -- Enzyme Inhibition Constant Data from BindingDB
Found 1 hit for monomerid = 42359
TargetLysosomal acid glucosylceramidase(Homo sapiens (Human))
The Scripps Research Institute Molecular Screening Center
Curated by PubChem BioAssay
LigandPNGBDBM42359(2-isopropyl-N~7~-(3-methoxyphenyl)-N~3~-(2-methylc...)
Affinity DataEC50: >5.00E+4nM. Assay description: Source (MLSCN Center Name): The Scripps Research Institute Molecular Screening Center Center Affiliation: The Scripps Research Institute, TSRI Assay ...
In DepthDetails PCBioAssay