BDBM42372 MLS000044409::N-cyclopropyl-3-(3,4-dichlorophenyl)-4-hydroxy-2-keto-1H-quinazoline-4-carboxamide::N-cyclopropyl-3-(3,4-dichlorophenyl)-4-hydroxy-2-oxo-1,2,3,4-tetrahydroquinazoline-4-carboxamide::N-cyclopropyl-3-(3,4-dichlorophenyl)-4-hydroxy-2-oxo-1H-quinazoline-4-carboxamide::N-cyclopropyl-3-(3,4-dichlorophenyl)-4-oxidanyl-2-oxidanylidene-1H-quinazoline-4-carboxamide::SMR000022186::cid_3245305
SMILES OC1(N(C(=O)Nc2ccccc12)c1ccc(Cl)c(Cl)c1)C(=O)NC1CC1
InChI Key InChIKey=JKXNEWQEOGIYSJ-UHFFFAOYSA-N
Data  1 EC50
  Tab Delimited (TSV)   2D SDfile   Computed 3D by Vconf -m prep SDfile
Find this compound or compounds like it in BindingDB:
Activity Spreadsheet -- Enzyme Inhibition Constant Data from BindingDB
Found 1 hit for monomerid = 42372
TargetLysosomal acid glucosylceramidase(Homo sapiens (Human))
The Scripps Research Institute Molecular Screening Center
Curated by PubChem BioAssay
LigandPNGBDBM42372(MLS000044409 | N-cyclopropyl-3-(3,4-dichlorophenyl...)
Affinity DataEC50: >5.00E+4nM. Assay description: Source (MLSCN Center Name): The Scripps Research Institute Molecular Screening Center Center Affiliation: The Scripps Research Institute, TSRI Assay ...
In DepthDetails PCBioAssay