BDBM42393 MLS000088702::N-(4-acetylphenyl)-2-(2-hydroxyethylsulfanyl)acetamide::N-(4-acetylphenyl)-2-(2-hydroxyethylthio)acetamide::N-(4-acetylphenyl)-2-[(2-hydroxyethyl)thio]acetamide::N-(4-ethanoylphenyl)-2-(2-hydroxyethylsulfanyl)ethanamide::SMR000072719::cid_2190575
SMILES CC(=O)c1ccc(NC(=O)CSCCO)cc1
InChI Key InChIKey=PXGXPOMBCLKALX-UHFFFAOYSA-N
Data  1 EC50
  Tab Delimited (TSV)   2D SDfile   Computed 3D by Vconf -m prep SDfile
Find this compound or compounds like it in BindingDB:
Activity Spreadsheet -- Enzyme Inhibition Constant Data from BindingDB
Found 1 hit for monomerid = 42393
TargetLysosomal acid glucosylceramidase(Homo sapiens (Human))
The Scripps Research Institute Molecular Screening Center
Curated by PubChem BioAssay
LigandPNGBDBM42393(MLS000088702 | N-(4-acetylphenyl)-2-(2-hydroxyethy...)
Affinity DataEC50: >5.00E+4nM. Assay description: Source (MLSCN Center Name): The Scripps Research Institute Molecular Screening Center Center Affiliation: The Scripps Research Institute, TSRI Assay ...
In DepthDetails PCBioAssay