BDBM42396 MLS000050546::N-[4-(diethylsulfamoyl)phenyl]-2-(3-fluoro-N-mesyl-anilino)acetamide::N-[4-(diethylsulfamoyl)phenyl]-2-(3-fluoro-N-methylsulfonylanilino)acetamide::N-[4-(diethylsulfamoyl)phenyl]-2-[(3-fluorophenyl)-methylsulfonyl-amino]ethanamide::N~1~-{4-[(diethylamino)sulfonyl]phenyl}-N~2~-(3-fluorophenyl)-N~2~-(methylsulfonyl)glycinamide::SMR000076501::cid_1295669
SMILES CCN(CC)S(=O)(=O)c1ccc(NC(=O)CN(c2cccc(F)c2)S(C)(=O)=O)cc1
InChI Key InChIKey=NXUPZMKZPIKYFD-UHFFFAOYSA-N
Data  1 EC50
  Tab Delimited (TSV)   2D SDfile   Computed 3D by Vconf -m prep SDfile
Find this compound or compounds like it in BindingDB:
Activity Spreadsheet -- Enzyme Inhibition Constant Data from BindingDB
Found 1 hit for monomerid = 42396
TargetLysosomal acid glucosylceramidase(Homo sapiens (Human))
The Scripps Research Institute Molecular Screening Center
Curated by PubChem BioAssay
LigandPNGBDBM42396(MLS000050546 | N-[4-(diethylsulfamoyl)phenyl]-2-(3...)
Affinity DataEC50: >5.00E+4nM. Assay description: Source (MLSCN Center Name): The Scripps Research Institute Molecular Screening Center Center Affiliation: The Scripps Research Institute, TSRI Assay ...
In DepthDetails PCBioAssay