BDBM42427 3-[(2,5-dimethylphenyl)sulfanylmethyl]-5-(oxolan-2-ylmethylcarbamoyl)-1,2-oxazole-4-carboxylic acid::3-[[(2,5-dimethylphenyl)thio]methyl]-5-(tetrahydrofurfurylcarbamoyl)isoxazole-4-carboxylic acid::3-[[(2,5-dimethylphenyl)thio]methyl]-5-[oxo-(2-oxolanylmethylamino)methyl]-4-isoxazolecarboxylic acid::MLS000560813::SMR000155825::cid_11958496
SMILES Cc1ccc(C)c(SCc2noc(C(=O)NCC3CCCO3)c2C(O)=O)c1
InChI Key InChIKey=KYEAKVQAEYTNDI-UHFFFAOYSA-N
Data  2 IC50
  Tab Delimited (TSV)   2D SDfile   Computed 3D by Vconf -m prep SDfile
Find this compound or compounds like it in BindingDB:
Activity Spreadsheet -- Enzyme Inhibition Constant Data from BindingDB
Found 2 hits for monomerid = 42427
TargetNeuropeptide Y receptor type 2(Homo sapiens (Human))
The Scripps Research Institute Molecular Screening Center
Curated by PubChem BioAssay
LigandPNGBDBM42427(3-[(2,5-dimethylphenyl)sulfanylmethyl]-5-(oxolan-2...)
Affinity DataIC50:  2.64E+4nM. Assay description: Source (MLSCN Center Name): The Scripps Research Institute Molecular Screening Center Affiliation: The Scripps Research Institute, TSRI Assay Provide...
In DepthDetails PCBioAssay
TargetNeuropeptide Y receptor type 1(Homo sapiens (Human))
The Scripps Research Institute Molecular Screening Center
Curated by PubChem BioAssay
LigandPNGBDBM42427(3-[(2,5-dimethylphenyl)sulfanylmethyl]-5-(oxolan-2...)
Affinity DataIC50: >3.50E+4nM. Assay description: Source (MLSCN Center Name): The Scripps Research Institute Molecular Screening Center Affiliation: The Scripps Research Institute, TSRI Assay Provide...
In DepthDetails PCBioAssay