BDBM424942 4-(3-isobutyl-5-methyl-4,5- dihydro-3H-1,2,2a1,5- tetraazaacenaphthylen-7-yl)- N-(1-methyl-1H-pyrazol-5- yl)pyridin-2-amine::US10517878, Compound I-20::US10842799, I-20
SMILES CC(C)CC1CN(C)c2cc(cc3nnc1n23)-c1ccnc(Nc2ccnn2C)c1
InChI Key InChIKey=RBGSJRZOFZEZPV-UHFFFAOYSA-N
Data  2 IC50
  Tab Delimited (TSV)   2D SDfile   Computed 3D by Vconf -m prep SDfile
Find this compound or compounds like it in BindingDB:
Activity Spreadsheet -- Enzyme Inhibition Constant Data from BindingDB
Found 2 hits for monomerid = 424942
TargetMitogen-activated protein kinase 1(Homo sapiens (Human))
Genentech
US Patent
LigandPNGBDBM424942(4-(3-isobutyl-5-methyl-4,5- dihydro-3H-1,2,2a1,5- ...)
Affinity DataIC50:  0.316nM. Assay description: Compounds were tested in an enzymatic assay using human ERK-2 (Mitogen Activated Kinase 1), recombinantly expressed as an n-terminal 6-His fusion pro...
Ligand InfoPC cidPC sid
In DepthDetails US Patent
TargetMitogen-activated protein kinase 1(Homo sapiens (Human))
Genentech
US Patent
LigandPNGBDBM424942(4-(3-isobutyl-5-methyl-4,5- dihydro-3H-1,2,2a1,5- ...)
Affinity DataIC50:  0.316nM. Assay description: Compounds were tested in an enzymatic assay using human ERK-2 (Mitogen Activated Kinase 1), recombinantly expressed as an n-terminal 6-His fusion pro...
Ligand InfoPC cidPC sid
In DepthDetails US Patent